Target
Aurora kinase A
Ligand
BDBM14201
Substrate
Histone H3
Meas. Tech.
Aurora Kinase Inhibition Assay
pH
7.5±n/a
Temperature
295.15±n/a K
IC50
3±n/a nM
Citation
 Moriarty, KJKoblish, HKGarrabrant, TMaisuria, JKhalil, EAli, FPetrounia, IPCrysler, CSMaroney, ACJohnson, DLGalemmo, RA The synthesis and SAR of 2-amino-pyrrolo[2,3-d]pyrimidines: a new class of Aurora-A kinase inhibitors. Bioorg Med Chem Lett 16:5778-83 (2006)  
Target
Name:
Aurora kinase A
Synonyms:
AURKA_MOUSE Airk1 Aura Aurora Kinase A (Aurora-A) Aurora-family kinase 1 Ayk1 Iak1 Serine/threonine-protein kinase Aurora-A Stk15 | Stk6
Type:
Enzyme
Mol. Mass.:
44791.66
Organism:
Mus musculus (mouse)
Description:
Residue:
395
  
Inhibitor
Name:
BDBM14201
Synonyms:
N-[3-(4-methylpiperazin-1-yl)phenyl]-7-phenyl-7H-pyrrolo[2,3-d]pyrimidin-2-amine | pyrrolopyrimidine 24
Type:
Small organic molecule
Emp. Form.:
C23H24N6
Mol. Mass.:
384.4769
SMILES:
CN1CCN(CC1)c1cccc(Nc2ncc3ccn(-c4ccccc4)c3n2)c1
:
Substrate
Name:
Histone H3
Synonyms:
H3.1-221 H3.1-I H3a H3g H3i Hist1h3g Hist1h3i
Type:
Other Protein Type
Mol. Mass.:
15425.07
Organism:
Mus musculus (mouse)
Description:
Residue:
136