Target
Aromatase
Ligand
BDBM14209
Substrate
Poly(Glu,Tyr)
Meas. Tech.
FLT3 Inhibition Assay
IC50
<1±n/a nM
Citation
 Moriarty, KJKoblish, HKGarrabrant, TMaisuria, JKhalil, EAli, FPetrounia, IPCrysler, CSMaroney, ACJohnson, DLGalemmo, RA The synthesis and SAR of 2-amino-pyrrolo[2,3-d]pyrimidines: a new class of Aurora-A kinase inhibitors. Bioorg Med Chem Lett 16:5778-83 (2006)  
Target
Name:
Aromatase
Synonyms:
ARO1 CP19A_HUMAN CYP19 CYPXIX Cytochrome P450 19A1 Cytochrome P450-C19 (CYP19) FL cytokine receptor precursor | P-450AROM
Type:
Enzyme
Mol. Mass.:
57888.92
Organism:
Homo sapiens (Human)
Description:
P11511
Residue:
503
  
Inhibitor
Name:
BDBM14209
Synonyms:
4-(4-{[7-(pyridin-2-yl)-7H-pyrrolo[2,3-d]pyrimidin-2-yl]amino}phenyl)-1,4-thiomorpholine-1,1-dione | pyrrolopyrimidine 32
Type:
Small organic molecule
Emp. Form.:
C21H20N6O2S
Mol. Mass.:
420.487
SMILES:
O=S1(=O)CCN(CC1)c1ccc(Nc2ncc3ccn(-c4ccccn4)c3n2)cc1
:
Substrate
Name:
Poly(Glu,Tyr)
Synonyms:
poly(E:Y) 4:1 | poly(Glu4/Tyr)
Type:
Random Polymer
Mol. Mass.:
358.43
Organism:
Description:
Residue:
3
NA