Target
Serine protease 1
Ligand
BDBM14353
Substrate
BDBM12679
Meas. Tech.
Enzyme Assay and Determination of the Inhibition Constants
Ki
130±n/a nM
Citation
 Katz, BAElrod, KVerner, EMackman, RLLuong, CShrader, WDSendzik, MSpencer, JRSprengeler, PAKolesnikov, ATai, VWHui, HCBreitenbucher, JGAllen, DJanc, JW Elaborate manifold of short hydrogen bond arrays mediating binding of active site-directed serine protease inhibitors. J Mol Biol 329:93-120 (2003)  
Target
Name:
Serine protease 1
Synonyms:
Alpha-trypsin chain 1 Beta-trypsin PRSS1 TRP1 TRY1_HUMAN Thrombin & trypsin Trypsin I | Trypsin-1
Type:
Enzyme
Mol. Mass.:
26557.80
Organism:
Homo sapiens (Human)
Description:
P07477
Residue:
247
  
Inhibitor
Name:
BDBM14353
Synonyms:
2-{5-[amino(iminiumyl)methyl]-6-fluoro-1H-indol-2-yl}-4-(dimethylcarbamoyl)-6-phenylbenzen-1-olate | CRA-14316
Type:
Small organic molecule
Emp. Form.:
C24H21FN4O2
Mol. Mass.:
416.4475
SMILES:
CN(C)C(=O)c1cc(-c2cc3cc(C(N)=[NH2+])c(F)cc3[nH]2)c([O-])c(c1)-c1ccccc1
:
Substrate
Name:
BDBM12679
Synonyms:
BDBM13790 Chromogenic Substrate
Type:
Small organic molecule
Emp. Form.:
C26H34N6O7S
Mol. Mass.:
574.649
SMILES:
Cc1ccc(cc1)S(=O)(=O)NCC(=O)N1CCCC1C(=O)NC(CCCCN)C(=O)Nc1ccc(cc1)[N+]([O-])=O
: