Target
Urokinase-type plasminogen activator
Ligand
BDBM14347
Substrate
BDBM13949
Meas. Tech.
Enzyme Assay and Determination of the Inhibition Constants
Ki
6000±n/a nM
Citation
 Katz, BAElrod, KVerner, EMackman, RLLuong, CShrader, WDSendzik, MSpencer, JRSprengeler, PAKolesnikov, ATai, VWHui, HCBreitenbucher, JGAllen, DJanc, JW Elaborate manifold of short hydrogen bond arrays mediating binding of active site-directed serine protease inhibitors. J Mol Biol 329:93-120 (2003)  
Target
Name:
Urokinase-type plasminogen activator
Synonyms:
PLAU UROK_HUMAN Urokinase-type plasminogen activator (uPA) | Urokinase-type plasminogen activator/surface receptor
Type:
Enzyme
Mol. Mass.:
48528.62
Organism:
Homo sapiens (Human)
Description:
P00749
Residue:
431
  
Inhibitor
Name:
BDBM14347
Synonyms:
CRA-1802 | {amino[2-(5-fluoro-2-hydroxyphenyl)-1H-1,3-benzodiazol-5-yl]methylidene}azanium
Type:
Small organic molecule
Emp. Form.:
C14H12FN4O
Mol. Mass.:
271.2691
SMILES:
NC(=[NH2+])c1ccc2nc([nH]c2c1)-c1cc(F)ccc1O
:
Substrate
Name:
BDBM13949
Synonyms:
(2S)-5-carbamimidamido-N-(4-nitrophenyl)-2-{2-[(2S)-2-(phenylformamido)propanamido]acetamido}pentanamide uPA Chromogenic Substrate
Type:
Small organic molecule
Emp. Form.:
C24H30N8O6
Mol. Mass.:
526.545
SMILES:
[#6]-[#6@H](-[#7]-[#6](=O)-c1ccccc1)-[#6](=O)-[#7]-[#6]-[#6](=O)-[#7]-[#6@@H](-[#6]-[#6]-[#6]\[#7]=[#6](\[#7])-[#7])-[#6](=O)-[#7]-c1ccc(cc1)-[#7+](-[#8-])=O
: