Target
Coagulation factor X
Ligand
BDBM14341
Substrate
BDBM13950
Meas. Tech.
Enzyme Assay and Determination of the Inhibition Constants
Ki
3500±n/a nM
Citation
 Katz, BAElrod, KVerner, EMackman, RLLuong, CShrader, WDSendzik, MSpencer, JRSprengeler, PAKolesnikov, ATai, VWHui, HCBreitenbucher, JGAllen, DJanc, JW Elaborate manifold of short hydrogen bond arrays mediating binding of active site-directed serine protease inhibitors. J Mol Biol 329:93-120 (2003)  
Target
Name:
Coagulation factor X
Synonyms:
Activated coagulation factor X (FXa) Coagulation factor X precursor F10 Factor X heavy chain Factor Xa Stuart-Prower factor
Type:
Enzyme
Mol. Mass.:
54726.60
Organism:
Homo sapiens (Human)
Description:
Residue:
488
  
Inhibitor
Name:
BDBM14341
Synonyms:
(2R)-2-(3-{5-[amino(iminiumyl)methyl]-1H-1,3-benzodiazol-2-yl}-5-(2-methoxyphenyl)-4-oxidophenyl)butanedioate | CRA-17312
Type:
Small organic molecule
Emp. Form.:
C25H20N4O6
Mol. Mass.:
472.4506
SMILES:
COc1ccccc1-c1cc(cc(-c2nc3ccc(cc3[nH]2)C(N)=[NH2+])c1[O-])[C@@H](CC([O-])=O)C([O-])=O
:
Substrate
Name:
BDBM13950
Synonyms:
(2S)-N-({[(1S)-4-carbamimidamido-1-[(4-nitrophenyl)carbamoyl]butyl]carbamoyl}methyl)-2-acetamidohexanamide Factor Xa (fXa) Chromogenic Substrate
Type:
Emp. Form.:
Mol. Mass.:
SMILES:
: