Target
Coagulation factor X
Ligand
BDBM14346
Substrate
BDBM13950
Meas. Tech.
Enzyme Assay and Determination of the Inhibition Constants
Ki
48±n/a nM
Citation
 Katz, BAElrod, KVerner, EMackman, RLLuong, CShrader, WDSendzik, MSpencer, JRSprengeler, PAKolesnikov, ATai, VWHui, HCBreitenbucher, JGAllen, DJanc, JW Elaborate manifold of short hydrogen bond arrays mediating binding of active site-directed serine protease inhibitors. J Mol Biol 329:93-120 (2003)  
Target
Name:
Coagulation factor X
Synonyms:
Activated coagulation factor X (FXa) Coagulation factor X precursor F10 Factor X heavy chain Factor Xa Stuart-Prower factor
Type:
Enzyme
Mol. Mass.:
54726.60
Organism:
Homo sapiens (Human)
Description:
Residue:
488
  
Inhibitor
Name:
BDBM14346
Synonyms:
(2R)-2-(3-{5-[amino(iminiumyl)methyl]-1H-indol-2-yl}-5-bromo-4-oxidophenyl)butanedioate | CRA-19858
Type:
Small organic molecule
Emp. Form.:
C19H14BrN3O5
Mol. Mass.:
444.237
SMILES:
NC(=[NH2+])c1ccc2[nH]c(cc2c1)-c1cc(cc(Br)c1[O-])[C@@H](CC([O-])=O)C([O-])=O
:
Substrate
Name:
BDBM13950
Synonyms:
(2S)-N-({[(1S)-4-carbamimidamido-1-[(4-nitrophenyl)carbamoyl]butyl]carbamoyl}methyl)-2-acetamidohexanamide Factor Xa (fXa) Chromogenic Substrate
Type:
Emp. Form.:
Mol. Mass.:
SMILES:
: