Target
Coagulation factor X
Ligand
BDBM14356
Substrate
BDBM13950
Meas. Tech.
Enzyme Assay and Determination of the Inhibition Constants
Ki
100±n/a nM
Citation
 Katz, BAElrod, KVerner, EMackman, RLLuong, CShrader, WDSendzik, MSpencer, JRSprengeler, PAKolesnikov, ATai, VWHui, HCBreitenbucher, JGAllen, DJanc, JW Elaborate manifold of short hydrogen bond arrays mediating binding of active site-directed serine protease inhibitors. J Mol Biol 329:93-120 (2003)  
Target
Name:
Coagulation factor X
Synonyms:
Activated coagulation factor X (FXa) Coagulation factor X precursor F10 Factor X heavy chain Factor Xa Stuart-Prower factor
Type:
Enzyme
Mol. Mass.:
54726.60
Organism:
Homo sapiens (Human)
Description:
Residue:
488
  
Inhibitor
Name:
BDBM14356
Synonyms:
(2R)-2-(3-{5-[amino(iminiumyl)methyl]-1H-indol-2-yl}-4-oxido-5-phenylphenyl)butanedioate | CRA-20818
Type:
Small organic molecule
Emp. Form.:
C25H19N3O5
Mol. Mass.:
441.4366
SMILES:
NC(=[NH2+])c1ccc2[nH]c(cc2c1)-c1cc(cc(c1[O-])-c1ccccc1)[C@@H](CC([O-])=O)C([O-])=O
:
Substrate
Name:
BDBM13950
Synonyms:
(2S)-N-({[(1S)-4-carbamimidamido-1-[(4-nitrophenyl)carbamoyl]butyl]carbamoyl}methyl)-2-acetamidohexanamide Factor Xa (fXa) Chromogenic Substrate
Type:
Emp. Form.:
Mol. Mass.:
SMILES:
: