Target
Ketohexokinase
Ligand
BDBM50349745
Substrate
Meas. Tech.
Enzyme Assay
IC50
490±n/a nM
Citation
 Zhang, XAbad, MCGibbs, ACKuo, GSong, FSui, ZKuo, LC Indazole compounds useful as ketohexokinase inhibitors US Patent  US9771375 Publication Date 9/26/2017 
Target
Name:
Ketohexokinase
Synonyms:
Hepatic fructokinase KHK_HUMAN Ketohexokinase (KHK) | Ketohexokinase (KHK) Isoform C
Type:
Enzyme Catalytic Domain
Mol. Mass.:
32521.64
Organism:
Homo sapiens (Human)
Description:
Residue:
298
  
Inhibitor
Name:
BDBM50349745
Synonyms:
CHEMBL1809172 US9771375, Example 124
Type:
Small organic molecule
Emp. Form.:
C19H18N4O2S
Mol. Mass.:
366.437
SMILES:
CSc1nn(-c2ccc(cc2)[N+]([O-])=O)c2cc(ccc12)C1=CCNCC1
: