Target
Ketohexokinase
Ligand
BDBM130666
Substrate
Meas. Tech.
Enzyme Assay
IC50
40.0±n/a nM
Citation
 Zhang, XAbad, MCGibbs, ACKuo, GSong, FSui, ZKuo, LC Indazole compounds useful as ketohexokinase inhibitors US Patent  US9771375 Publication Date 9/26/2017 
Target
Name:
Ketohexokinase
Synonyms:
Hepatic fructokinase KHK_HUMAN Ketohexokinase (KHK) | Ketohexokinase (KHK) Isoform C
Type:
Enzyme Catalytic Domain
Mol. Mass.:
32521.64
Organism:
Homo sapiens (Human)
Description:
Residue:
298
  
Inhibitor
Name:
BDBM130666
Synonyms:
US8822447, 180 | US9771375, Example 180
Type:
Small organic molecule
Emp. Form.:
C20H21N3S
Mol. Mass.:
335.466
SMILES:
CSc1nn(-c2ccccc2C)c2cc(ccc12)C1=CCNCC1
: