Target
Bifunctional epoxide hydrolase 2
Ligand
BDBM342634
Substrate
Meas. Tech.
Biochemical Screening Assay
IC50
0.168±n/a nM
Citation
 Mendez-Perez, MBreitschopf, KLorenz, KStrobel, HWang, LSchiffer, AGoerlitzer, J Thienomethylpiperazine derivatives as inhibitors of soluble epoxide hydrolase US Patent  US9776991 Publication Date 10/3/2017 
Target
Name:
Bifunctional epoxide hydrolase 2
Synonyms:
Cytosolic epoxide hydrolase 2 EPHX2 HYES_HUMAN Soluble epoxide hydrolase (sEH) | epoxide hydrolase 2, cytoplasmic
Type:
Enzyme
Mol. Mass.:
62613.07
Organism:
Homo sapiens (Human)
Description:
P34913
Residue:
555
  
Inhibitor
Name:
BDBM342634
Synonyms:
5-[4-(Pyridine-3-carbonyl)-piperazin-1-ylmethyl]-thiophene-2-carboxylic acid 2-trifluoromethyl-benzylamide | US9776991, Example 4
Type:
Small organic molecule
Emp. Form.:
C24H23F3N4O2S
Mol. Mass.:
488.525
SMILES:
FC(F)(F)c1ccccc1CNC(=O)c1ccc(CN2CCN(CC2)C(=O)c2cccnc2)s1
: