Target
Sodium channel protein type 5 subunit alpha
Ligand
BDBM342994
Substrate
Meas. Tech.
In Vitro PX Assay
IC50
>10000±n/a nM
Citation
 Weiss, MDiMauro, EFDineen, TGraceffa, RGuzman-Perez, AHuang, HKreiman, CMarx, IENguyen, HNPeterson, EADeak, HL Bicyclic sulfonamide compounds as sodium channel inhibitors US Patent  US9776995 Publication Date 10/3/2017 
Target
Name:
Sodium channel protein type 5 subunit alpha
Synonyms:
HH1 SCN5A_HUMAN Sodium channel protein type 5 subunit alpha/beta-1/beta-2 Voltage-gated sodium channel subunit alpha Nav1.5
Type:
Enzyme
Mol. Mass.:
226908.60
Organism:
Homo sapiens (Human)
Description:
Q14524
Residue:
2016
  
Inhibitor
Name:
BDBM342994
Synonyms:
1-(4-(2-fluoro-5-methylphenoxy)-2-methoxyphenyl)-N-1,3,4-thiadiazol-2-yl-6-isoquinolinesulfonamide | US9776995, Example 190
Type:
Small organic molecule
Emp. Form.:
C25H19FN4O4S2
Mol. Mass.:
522.571
SMILES:
COc1cc(Oc2cc(C)ccc2F)ccc1-c1nccc2cc(ccc12)S(=O)(=O)Nc1nncs1
: