Target
Sodium channel protein type 9 subunit alpha
Ligand
BDBM343183
Substrate
Meas. Tech.
In Vitro PX Assay
IC50
105±n/a nM
Citation
 Weiss, MDiMauro, EFDineen, TGraceffa, RGuzman-Perez, AHuang, HKreiman, CMarx, IENguyen, HNPeterson, EADeak, HL Bicyclic sulfonamide compounds as sodium channel inhibitors US Patent  US9776995 Publication Date 10/3/2017 
Target
Name:
Sodium channel protein type 9 subunit alpha
Synonyms:
NENA Peripheral sodium channel 1 SCN9A_HUMAN Voltage-gated sodium channel subunit Nav1.7 hNE-Na
Type:
Protein
Mol. Mass.:
226375.97
Organism:
Homo sapiens (Human)
Description:
Q15858
Residue:
1988
  
Inhibitor
Name:
BDBM343183
Synonyms:
4-(2',4'-difluoro-5-methoxy-2-methyl-4-biphenylyl)-N-3-isoxazolyl-7-quinazolinesulfonamide | US9776995, Example 563
Type:
Small organic molecule
Emp. Form.:
C25H18F2N4O4S
Mol. Mass.:
508.497
SMILES:
COc1cc(c(C)cc1-c1ncnc2cc(ccc12)S(=O)(=O)Nc1ccon1)-c1ccc(F)cc1F
: