Target
Sodium channel protein type 9 subunit alpha
Ligand
BDBM343191
Substrate
Meas. Tech.
In Vitro PX Assay
IC50
72.0±n/a nM
Citation
 Weiss, MDiMauro, EFDineen, TGraceffa, RGuzman-Perez, AHuang, HKreiman, CMarx, IENguyen, HNPeterson, EADeak, HL Bicyclic sulfonamide compounds as sodium channel inhibitors US Patent  US9776995 Publication Date 10/3/2017 
Target
Name:
Sodium channel protein type 9 subunit alpha
Synonyms:
NENA Peripheral sodium channel 1 SCN9A_HUMAN Voltage-gated sodium channel subunit Nav1.7 hNE-Na
Type:
Protein
Mol. Mass.:
226375.97
Organism:
Homo sapiens (Human)
Description:
Q15858
Residue:
1988
  
Inhibitor
Name:
BDBM343191
Synonyms:
4-(2,3'-dichloro-5-methoxy-4-biphenylyl)-N-2-pyrimidinyl-7-quinazolinesulfonamide | US9776995, Example 437
Type:
Small organic molecule
Emp. Form.:
C25H17Cl2N5O3S
Mol. Mass.:
538.405
SMILES:
COc1cc(c(Cl)cc1-c1ncnc2cc(ccc12)S(=O)(=O)Nc1ncccn1)-c1cccc(Cl)c1
: