Target
Sodium channel protein type 9 subunit alpha
Ligand
BDBM343212
Substrate
Meas. Tech.
In Vitro PX Assay
IC50
71.0±n/a nM
Citation
 Weiss, MDiMauro, EFDineen, TGraceffa, RGuzman-Perez, AHuang, HKreiman, CMarx, IENguyen, HNPeterson, EADeak, HL Bicyclic sulfonamide compounds as sodium channel inhibitors US Patent  US9776995 Publication Date 10/3/2017 
Target
Name:
Sodium channel protein type 9 subunit alpha
Synonyms:
NENA Peripheral sodium channel 1 SCN9A_HUMAN Voltage-gated sodium channel subunit Nav1.7 hNE-Na
Type:
Protein
Mol. Mass.:
226375.97
Organism:
Homo sapiens (Human)
Description:
Q15858
Residue:
1988
  
Inhibitor
Name:
BDBM343212
Synonyms:
(M)-4-(2-chloro-3''-fluoro-5-methoxy-4-biphenylyl)-3-hydroxy-N-3-isoxazolyl-7-quinolinesulfonamide US9776995, Example 338
Type:
Small organic molecule
Emp. Form.:
C25H17ClFN3O5S
Mol. Mass.:
525.936
SMILES:
COc1cc(c(Cl)cc1-c1c(O)cnc2cc(ccc12)S(=O)(=O)Nc1ccon1)-c1cccc(F)c1
: