Target
CREB-binding protein
Ligand
BDBM349496
Substrate
Meas. Tech.
CBP TR-FRET Binding Assay
IC50
3.00±n/a nM
Citation
 Romero, FAMagnuson, SRPastor, RTsui, VHMurray, JCrawford, TBurdick, DJAlbrecht, BKCote, ATaylor, AMNasveschuck, CGLeBlanc, YHewitt, MCLai, KWChen, K Therapeutic compounds and uses thereof US Patent  US10206931 Publication Date 2/19/2019 
Target
Name:
CREB-binding protein
Synonyms:
CBP CREB-binding protein (CBP) CREBBP
Type:
Transcription Coactivator
Mol. Mass.:
265411.66
Organism:
Homo sapiens (Human)
Description:
Q92793
Residue:
2442
  
Inhibitor
Name:
BDBM349496
Synonyms:
(difluoromethyl)-5-(1- | US10206931, Example 304
Type:
Small organic molecule
Emp. Form.:
C23H25F2N5O
Mol. Mass.:
425.4743
SMILES:
CN\C=C(/C=N)c1cc2CCN(c2cc1C(F)F)c1cccc2NC(=O)C[C@@H](C)Nc12
: