Target
CREB-binding protein
Ligand
BDBM349498
Substrate
Meas. Tech.
CBP TR-FRET Binding Assay
IC50
3.00±n/a nM
Citation
 Romero, FAMagnuson, SRPastor, RTsui, VHMurray, JCrawford, TBurdick, DJAlbrecht, BKCote, ATaylor, AMNasveschuck, CGLeBlanc, YHewitt, MCLai, KWChen, K Therapeutic compounds and uses thereof US Patent  US10206931 Publication Date 2/19/2019 
Target
Name:
CREB-binding protein
Synonyms:
CBP CREB-binding protein (CBP) CREBBP
Type:
Transcription Coactivator
Mol. Mass.:
265411.66
Organism:
Homo sapiens (Human)
Description:
Q92793
Residue:
2442
  
Inhibitor
Name:
BDBM349498
Synonyms:
1-methyl-4-[(4R)-4-methyl-2-oxo-1,3,4,5-tetrahydro-1,5-benzodiazepin-6-yl]-7-(1-methylpyrazol-4-yl)-2,3-dihydroquinoxaline-6-carbonitrile | US10206931, Example 306
Type:
Small organic molecule
Emp. Form.:
C24H27N7O
Mol. Mass.:
429.5175
SMILES:
CN\C=C(/C=N)c1cc2N(C)CCN(c3cccc4NC(=O)C[C@@H](C)Nc34)c2cc1C#N
: