Target
Mitogen-activated protein kinase 14
Ligand
BDBM14840
Substrate
BDBM14832
Meas. Tech.
Fluorescence Exchange Curve Assay
pH
7±n/a
Temperature
296.15±n/a K
Kd
0.5±n/a nM
Citation
 Kroe, RRRegan, JProto, APeet, GWRoy, TLandro, LDFuschetto, NGPargellis, CAIngraham, RH Thermal denaturation: a method to rank slow binding, high-affinity P38alpha MAP kinase inhibitors. J Med Chem 46:4669-75 (2003)  
Target
Name:
Mitogen-activated protein kinase 14
Synonyms:
CSAID-binding protein CSBP1 CSPB1 MAP kinase 14 MAP kinase p38 alpha MAPK14 MK14_HUMAN Mitogen-activated protein kinase p38 alpha Stress-activated protein kinase 2a | p38 MAP kinase alpha/beta
Type:
Serine/threonine-protein kinase
Mol. Mass.:
41286.76
Organism:
Homo sapiens (Human)
Description:
Q16539
Residue:
360
  
Inhibitor
Name:
BDBM14840
Synonyms:
1-(5-tert-Butyl-2-p-tolyl-2H-pyrazol-3-yl)-3-[4-(2-pyridin-4-yl-ethoxy)-naphthalen-1-yl]-urea BIRB-796 Analog 30 | diaryl urea compound 9
Type:
Small organic molecule
Emp. Form.:
C32H33N5O2
Mol. Mass.:
519.6367
SMILES:
Cc1ccc(cc1)-n1nc(cc1NC(=O)Nc1ccc(OCCc2ccncc2)c2ccccc12)C(C)(C)C
:
Substrate
Name:
BDBM14832
Synonyms:
3-(4-fluorophenyl)-2-pyridin-4-yl-6-thia-1,4-diazabicyclo[3.3.0]octa-2,4-diene CHEMBL313417 SKF 86002
Type:
Small organic molecule
Emp. Form.:
C16H12FN3S
Mol. Mass.:
297.35
SMILES:
Fc1ccc(cc1)-c1nc2SCCn2c1-c1ccncc1
: