Target
TGF-beta receptor type-1
Ligand
BDBM346271
Substrate
Meas. Tech.
TGF-beta 1 Assay
EC50
9.00±n/a nM
Citation
 KC, SKWallace, DMCao, JChiruta, CHood, J 3-(1H-benzo[D]imidazol-2-yl)-1H-pyrazolo[3,4-C]pyridine and therapeutic uses thereof US Patent  US10202377 Publication Date 2/12/2019 
Target
Name:
TGF-beta receptor type-1
Synonyms:
ALK-5 Activin A receptor type II-like protein kinase of 53kD SKR4 TGF-beta receptor type I TGFBR1 TGFR1_HUMAN Transforming growth factor-beta receptor type I
Type:
enzyme
Mol. Mass.:
55968.24
Organism:
Homo sapiens (Human)
Description:
P36897
Residue:
503
  
Inhibitor
Name:
BDBM346271
Synonyms:
US10202377, Compound 13
Type:
Small organic molecule
Emp. Form.:
C27H22FN7
Mol. Mass.:
463.5089
SMILES:
CN(C)Cc1cncc(c1)-c1cc2c(n[nH]c2cn1)-c1nc2c(cccc2[nH]1)-c1cccc(F)c1
: