Target
TGF-beta receptor type-1
Ligand
BDBM346353
Substrate
Meas. Tech.
TGF-beta 1 Assay
EC50
9.00±n/a nM
Citation
 KC, SKWallace, DMCao, JChiruta, CHood, J 3-(1H-benzo[D]imidazol-2-yl)-1H-pyrazolo[3,4-C]pyridine and therapeutic uses thereof US Patent  US10202377 Publication Date 2/12/2019 
Target
Name:
TGF-beta receptor type-1
Synonyms:
ALK-5 Activin A receptor type II-like protein kinase of 53kD SKR4 TGF-beta receptor type I TGFBR1 TGFR1_HUMAN Transforming growth factor-beta receptor type I
Type:
enzyme
Mol. Mass.:
55968.24
Organism:
Homo sapiens (Human)
Description:
P36897
Residue:
503
  
Inhibitor
Name:
BDBM346353
Synonyms:
US10202377, Compound 427
Type:
Small organic molecule
Emp. Form.:
C33H25FN8O3S
Mol. Mass.:
632.667
SMILES:
CS(=O)(=O)NCc1cc(F)cc(c1)-c1cccc2[nH]c(nc12)-c1n[nH]c2cnc(cc12)-c1cncc(NC(=O)c2ccccc2)c1
: