Target
Ubiquitin carboxyl-terminal hydrolase isozyme L1
Ligand
BDBM50442907
Substrate
Meas. Tech.
Fluorometric Ub-AMC Hydrolysis Assay
pH
7.5±n/a
Temperature
298.15±n/a K
IC50
5400±n/a nM
Comments
extracted
Citation
 Ott, CABaljinnyam, BZakharov, AVJadhav, ASimeonov, AZhuang, Z Cell Lysate-Based AlphaLISA Deubiquitinase Assay Platform for Identification of Small Molecule Inhibitors. ACS Chem Biol 12:2399-2407 (2017)  
Target
Name:
Ubiquitin carboxyl-terminal hydrolase isozyme L1
Synonyms:
Neuron cytoplasmic protein 9.5 PGP9.5 UCHL1 Ubiquitin thioesterase L1
Type:
PROTEIN
Mol. Mass.:
24819.03
Organism:
Homo sapiens (Human)
Description:
ChEMBL_974327
Residue:
223
  
Inhibitor
Name:
BDBM50442907
Synonyms:
Acetyl Isogambogic Acid | CHEMBL3039433
Type:
Small organic molecule
Emp. Form.:
C40H46O9
Mol. Mass.:
670.7878
SMILES:
[H]C12[#6]-[#6@H]-3-[#6]=[#6]4-[#6](=O)-c5c(-[#8]-[#6](-[#6])=O)c6-[#6]=[#6]C([#6])([#6]-[#6]\[#6]=[#6](\[#6])-[#6])[#8]-c6c(-[#6]\[#6]=[#6](\[#6])-[#6])c5-[#8][C@@]14C([#6]\[#6]=[#6](/[#6])-[#6](-[#8])=O)([#8]C2([#6])[#6])[#6]-3=O
: