Target
Ubiquitin carboxyl-terminal hydrolase isozyme L5
Ligand
BDBM50069762
Substrate
Meas. Tech.
Fluorometric Ub-AMC Hydrolysis Assay
pH
7.5±n/a
Temperature
298.15±n/a K
IC50
>114000±n/a nM
Comments
extracted
Citation
 Ott, CABaljinnyam, BZakharov, AVJadhav, ASimeonov, AZhuang, Z Cell Lysate-Based AlphaLISA Deubiquitinase Assay Platform for Identification of Small Molecule Inhibitors. ACS Chem Biol 12:2399-2407 (2017)  
Target
Name:
Ubiquitin carboxyl-terminal hydrolase isozyme L5
Synonyms:
CGI-70 UCH37 UCHL5_HUMAN Ubiquitin carboxyl-terminal hydrolase isozyme L5 | Ubiquitin thioesterase L5
Type:
PROTEIN
Mol. Mass.:
37597.89
Organism:
Homo sapiens (Human)
Description:
ChEMBL_109575
Residue:
329
  
Inhibitor
Name:
BDBM50069762
Synonyms:
CHEMBL3182437 US9802904, 87
Type:
Small organic molecule
Emp. Form.:
C23H24N6
Mol. Mass.:
384.4769
SMILES:
CC(C)c1ccccc1-c1ncc(C)c(NCc2ccc(cc2)-n2ccnn2)n1
: