Target
Coagulation factor VII
Ligand
BDBM14933
Substrate
BDBM13777
Meas. Tech.
Enzyme Inhibition Assay
Ki
280±n/a nM
Citation
 Shrader, WDKolesnikov, ABurgess-Henry, JRai, RHendrix, JHu, HTorkelson, STon, TYoung, WBKatz, BAYu, CTang, JCabuslay, RSanford, EJanc, JWSprengeler, PA Factor VIIa inhibitors: gaining selectivity within the trypsin family. Bioorg Med Chem Lett 16:1596-600 (2006)  
Target
Name:
Coagulation factor VII
Synonyms:
Eptacog alfa FA7_HUMAN Factor VIIa (fVIIa) SPCA serum prothrombin conversion accelerator
Type:
Enzyme
Mol. Mass.:
51599.89
Organism:
Homo sapiens (Human)
Description:
Residue:
466
  
Inhibitor
Name:
BDBM14933
Synonyms:
2-[3-(5-carbamimidoyl-1H-1,3-benzodiazol-2-yl)-4-hydroxy-5-[3-(2-oxo-1,3-dioxan-4-yl)phenyl]phenyl]butanedioic acid | 5-amidino benzimidazole analog 44
Type:
Small organic molecule
Emp. Form.:
C28H24N4O8
Mol. Mass.:
544.5122
SMILES:
NC(=N)c1ccc2nc([nH]c2c1)-c1cc(cc(c1O)-c1cccc(c1)C1CCOC(=O)O1)C(CC(O)=O)C(O)=O
:
Substrate
Name:
BDBM13777
Synonyms:
(2S)-5-carbamimidamido-2-{2-[(2R)-3-cyclohexyl-2-methanesulfonamidopropanamido]butanamido}-N-(4-nitrophenyl)pentanamide; acetic acid Pefachrome FVIIa
Type:
Small organic molecule
Emp. Form.:
C26H42N8O7S
Mol. Mass.:
610.726
SMILES:
CCC(NC(=O)C(CC1CCCCC1)NS(C)(=O)=O)C(=O)NC(CCC\[NH+]=C(\N)[NH-])C(=O)Nc1ccc(cc1)[N+]([O-])=O
: