Target
Angiopoietin-1 receptor
Ligand
BDBM14957
Substrate
Her2 Peptide Substrate
Meas. Tech.
Homogeneous Time-Resolved Fluorescence (HTRF) Enzyme Assay
pH
7.5±n/a
Temperature
295.15±n/a K
IC50
8±n/a nM
Citation
 Cee, VJAlbrecht, BKGeuns-Meyer, SHughes, PBellon, SBready, JCaenepeel, SChaffee, SCCoxon, AEmery, MFretland, JGallant, PGu, YHodous, BLHoffman, DJohnson, REKendall, RKim, JLLong, AMMcGowan, DMorrison, MOlivieri, PRPatel, VFPolverino, APowers, DRose, PWang, LZhao, H Alkynylpyrimidine amide derivatives as potent, selective, and orally active inhibitors of Tie-2 kinase. J Med Chem 50:627-40 (2007)  
Target
Name:
Angiopoietin-1 receptor
Synonyms:
TEK TIE2_HUMAN Tyrosine-protein kinase receptor (TIE-2) Tyrosine-protein kinase receptor TEK (p140 TEK) Tyrosine-protein kinase receptor TIE2/TEK VMCM1 p140 TEK
Type:
Enzyme
Mol. Mass.:
125835.70
Organism:
Homo sapiens (Human)
Description:
Q02763
Residue:
1124
  
Inhibitor
Name:
BDBM14957
Synonyms:
5-(2-(2-Aminopyrimidin-5-yl)ethynyl)-N-(2-((3-(dimethylamino)propyl)(methyl)amino)-5-(trifluoromethyl)phenyl)-2-fluorobenzamide alkynylpyrimidine amide 6h
Type:
Small organic molecule
Emp. Form.:
C26H26F4N6O
Mol. Mass.:
514.5179
SMILES:
CN(C)CCCN(C)c1ccc(cc1NC(=O)c1cc(ccc1F)C#Cc1cnc(N)nc1)C(F)(F)F
:
Substrate
Name:
Her2 Peptide Substrate
Synonyms:
Biotinylated Her2 Peptide Substrate | biotinylated long chain peptide
Type:
Peptide
Mol. Mass.:
2278.65
Organism:
Description:
Residue:
20