Target
Vascular endothelial growth factor receptor 2
Ligand
BDBM14980
Substrate
Gastrin Peptide Substrate
Meas. Tech.
Homogeneous Time-Resolved Fluorescence (HTRF) Enzyme Assay
IC50
1300±n/a nM
Citation
 Hodous, BLGeuns-Meyer, SDHughes, PEAlbrecht, BKBellon, SBready, JCaenepeel, SCee, VJChaffee, SCCoxon, AEmery, MFretland, JGallant, PGu, YHoffman, DJohnson, REKendall, RKim, JLLong, AMMorrison, MOlivieri, PRPatel, VFPolverino, ARose, PTempest, PWang, LWhittington, DAZhao, H Evolution of a highly selective and potent 2-(pyridin-2-yl)-1,3,5-triazine Tie-2 kinase inhibitor. J Med Chem 50:611-26 (2007)  
Target
Name:
Vascular endothelial growth factor receptor 2
Synonyms:
CD_antigen=CD309 Fetal liver kinase 1 (FLK-1) KDR Protein-tyrosine kinase receptor Flk-1 VEGFR-2 VEGFR2 Vascular Endothelial Growth Factor Receptor Kinase 2 Vascular endothelial growth factor receptor 2 (KDR) Vascular endothelial growth factor receptor 2 (VEGFR2) Vascular endothelial growth factor receptor-2 (VEGFR-2)
Type:
Receptor Tyrosine Kinase
Mol. Mass.:
151510.97
Organism:
Homo sapiens (Human)
Description:
P35968
Residue:
1356
  
Inhibitor
Name:
BDBM14980
Synonyms:
4-Methyl-N-(2-(piperidin-1-yl)-5-(trifluoromethyl)phenyl)-3-(3-(pyrimidin-4-yl)pyridin-2-yloxy)benzamide pyridinyl pyrimidine 45
Type:
Small organic molecule
Emp. Form.:
C29H26F3N5O2
Mol. Mass.:
533.5442
SMILES:
Cc1ccc(cc1Oc1ncccc1-c1ccncn1)C(=O)Nc1cc(ccc1N1CCCCC1)C(F)(F)F
:
Substrate
Name:
Gastrin Peptide Substrate
Synonyms:
Biotinylated gastrin peptide substrate gastrin substrate
Type:
Peptide
Mol. Mass.:
1823.88
Organism:
Description:
Residue:
15
ITINEEEEAYGWLDF