Target
E3 ubiquitin-protein ligase Mdm2 [17-125]
Ligand
BDBM227737
Substrate
Meas. Tech.
FRET Assay
Temperature
298.15±n/a K
IC50
899.2±n/a nM
Comments
extracted
Citation
 Cammarano, CMChristopher, MPDinsmore, CDoll, RJFradera Llinas, FXLi, CMachacek, MMartinez, MNair, LGPan, WReutershan, MHShizuka, MSteinhuebel, DPSun, BThompson, CFTrotter, BWWang, YYang, LBogen, SLVoss, MEPanda, JKurissery, AT 2,6,7,8 substituted purines as HDM2 inhibitors US Patent  US9540377 Publication Date 1/10/2017 
Target
Name:
E3 ubiquitin-protein ligase Mdm2 [17-125]
Synonyms:
Double minute 2 protein MDM2 p53-binding protein Mdm2
Type:
Enzyme Catalytic Domain
Mol. Mass.:
12522.24
Organism:
Homo sapiens (Human)
Description:
Residue 17 to 125
Residue:
109
  
Inhibitor
Name:
BDBM227737
Synonyms:
US9540377, 6.82
Type:
Emp. Form.:
C27H28F3N5O2
Mol. Mass.:
511.5387
SMILES:
CN(CC(C)(C)C)c1nc(nc2nc(-c3cccc(C)c3)n(Cc3ccc(cc3)C(F)(F)F)c12)C(O)=O
: