Target
E3 ubiquitin-protein ligase Mdm2 [17-125]
Ligand
BDBM224176
Substrate
Meas. Tech.
FRET Assay
Temperature
298.15±n/a K
IC50
0.4938±n/a nM
Comments
extracted
Citation
 Cammarano, CMChristopher, MPDinsmore, CDoll, RJFradera Llinas, FXLi, CMachacek, MMartinez, MNair, LGPan, WReutershan, MHShizuka, MSteinhuebel, DPSun, BThompson, CFTrotter, BWWang, YYang, LBogen, SLVoss, MEPanda, JKurissery, AT 2,6,7,8 substituted purines as HDM2 inhibitors US Patent  US9540377 Publication Date 1/10/2017 
Target
Name:
E3 ubiquitin-protein ligase Mdm2 [17-125]
Synonyms:
Double minute 2 protein MDM2 p53-binding protein Mdm2
Type:
Enzyme Catalytic Domain
Mol. Mass.:
12522.24
Organism:
Homo sapiens (Human)
Description:
Residue 17 to 125
Residue:
109
  
Inhibitor
Name:
BDBM224176
Synonyms:
5-{6-(5- chloropyridin-3-yl)- 8-[(3r)-3-(2- fluorophenyl)morpho- lin-4-yl]-7-[(trans-4- methylcyclohexyl) methyl]-7h-purin-2-yl}- 1,3,4-oxadiazol- 2(3h)-one | US9540377, 16.95
Type:
Small organic molecule
Emp. Form.:
C30H30ClFN8O3
Mol. Mass.:
605.062
SMILES:
C[C@H]1CC[C@H](Cn2c(nc3nc(nc(-c4cncc(Cl)c4)c23)-c2n[nH]c(=O)o2)N2CCOC[C@H]2c2ccccc2F)CC1
: