Target
Mitogen-activated protein kinase 14
Ligand
BDBM15764
Substrate
myelin basic protein
Meas. Tech.
In Vitro Kinase Assay
pH
7.4±n/a
Temperature
303.15±n/a K
IC50
21±n/a nM
Citation
 Trejo, AArzeno, HBrowner, MChanda, SCheng, SComer, DDDalrymple, SADunten, PLafargue, JLovejoy, BFreire-Moar, JLim, JMcintosh, JMiller, JPapp, EReuter, DRoberts, RSanpablo, FSaunders, JSong, KVillasenor, AWarren, SDWelch, MWeller, PWhiteley, PEZeng, LGoldstein, DM Design and synthesis of 4-azaindoles as inhibitors of p38 MAP kinase. J Med Chem 46:4702-13 (2003)  
Target
Name:
Mitogen-activated protein kinase 14
Synonyms:
CSAID-binding protein CSBP1 CSPB1 MAP kinase 14 MAP kinase p38 alpha MAPK14 MK14_HUMAN Mitogen-activated protein kinase p38 alpha Stress-activated protein kinase 2a | p38 MAP kinase alpha/beta
Type:
Serine/threonine-protein kinase
Mol. Mass.:
41286.76
Organism:
Homo sapiens (Human)
Description:
Q16539
Residue:
360
  
Inhibitor
Name:
BDBM15764
Synonyms:
3-(4-Fluorophenyl)-1-methoxy-ethyl-2-pyridin-4-yl-1Hpyrrolo[3,2-b]pyridine 4-[3-(4-fluorophenyl)-1-(1-methoxyethyl)-1H-pyrrolo[3,2-b]pyridin-2-yl]pyridine
Type:
Small organic molecule
Emp. Form.:
C21H18FN3O
Mol. Mass.:
347.3855
SMILES:
COC(C)n1c(c(-c2ccc(F)cc2)c2ncccc12)-c1ccncc1
:
Substrate
Name:
myelin basic protein
Synonyms:
MBP Myelin A1 protein biotin-MBP protein | biotin-myelin basic protein
Type:
Other Protein Type
Mol. Mass.:
33133.33
Organism:
Homo sapiens (Human)
Description:
Residue:
304