Target
Mitogen-activated protein kinase 14
Ligand
BDBM15774
Substrate
myelin basic protein
Meas. Tech.
In Vitro Kinase Assay
pH
7.4±n/a
Temperature
303.15±n/a K
IC50
1±n/a nM
Citation
 Trejo, AArzeno, HBrowner, MChanda, SCheng, SComer, DDDalrymple, SADunten, PLafargue, JLovejoy, BFreire-Moar, JLim, JMcintosh, JMiller, JPapp, EReuter, DRoberts, RSanpablo, FSaunders, JSong, KVillasenor, AWarren, SDWelch, MWeller, PWhiteley, PEZeng, LGoldstein, DM Design and synthesis of 4-azaindoles as inhibitors of p38 MAP kinase. J Med Chem 46:4702-13 (2003)  
Target
Name:
Mitogen-activated protein kinase 14
Synonyms:
CSAID-binding protein CSBP1 CSPB1 MAP kinase 14 MAP kinase p38 alpha MAPK14 MK14_HUMAN Mitogen-activated protein kinase p38 alpha Stress-activated protein kinase 2a | p38 MAP kinase alpha/beta
Type:
Serine/threonine-protein kinase
Mol. Mass.:
41286.76
Organism:
Homo sapiens (Human)
Description:
Q16539
Residue:
360
  
Inhibitor
Name:
BDBM15774
Synonyms:
(2R)-1-({4-[3-(4-fluorophenyl)-1H-pyrrolo[3,2-b]pyridin-2-yl]pyridin-2-yl}amino)propan-2-ol | 4-Azaindole 42c
Type:
Small organic molecule
Emp. Form.:
C21H19FN4O
Mol. Mass.:
362.4002
SMILES:
C[C@@H](O)CNc1cc(ccn1)-c1[nH]c2cccnc2c1-c1ccc(F)cc1
:
Substrate
Name:
myelin basic protein
Synonyms:
MBP Myelin A1 protein biotin-MBP protein | biotin-myelin basic protein
Type:
Other Protein Type
Mol. Mass.:
33133.33
Organism:
Homo sapiens (Human)
Description:
Residue:
304