Target
Beta-secretase 1
Ligand
BDBM15801
Substrate
ELGY-9
Meas. Tech.
Fluorecent Resonance Energy Transfer (FRET) Assay
pH
4.6±n/a
Temperature
295.15±n/a K
IC50
285±16 nM
Citation
 Rojo, IMartin, JABroughton, HTimm, DErickson, JYang, HCMcCarthy, JR Macrocyclic peptidomimetic inhibitors of beta-secretase (BACE): first X-ray structure of a macrocyclic peptidomimetic-BACE complex. Bioorg Med Chem Lett 16:191-5 (2006)  
Target
Name:
Beta-secretase 1
Synonyms:
ASP2 Aspartyl protease 2 BACE1 Beta-secretase (BACE) Beta-secretase 1 (BACE 1) Beta-secretase 1 (BACE1) Beta-site amyloid precursor protein cleaving enzyme 1 Memapsin-2 beta-Secretase (BACE-1) | beta-Secretase (BACE1)
Type:
Protein
Mol. Mass.:
55755.10
Organism:
Homo sapiens (Human)
Description:
P56817
Residue:
501
  
Inhibitor
Name:
BDBM15801
Synonyms:
Macrocyclic BACE inhibitor 3 | tert-butyl N-[(3S,6S,13S)-13-[(1S,3R)-3-{[(1S)-1-(benzylcarbamoyl)-2-methylpropyl]carbamoyl}-1-hydroxy-3-methylpropyl]-3-methyl-2,5-dioxo-1,4-diazacyclotridecan-6-yl]carbamate
Type:
Small organic molecule
Emp. Form.:
C34H55N5O7
Mol. Mass.:
645.8298
SMILES:
CC(C)[C@H](NC(=O)[C@H](C)C[C@H](O)[C@@H]1CCCCCC[C@H](NC(=O)OC(C)(C)C)C(=O)N[C@@H](C)C(=O)N1)C(=O)NCc1ccccc1
:
Substrate
Name:
ELGY-9
Synonyms:
Type:
Peptide
Mol. Mass.:
358.43
Organism:
Description:
It is an aminobenzoate-based FRET peptide containing Swedish mutation at the beta-secretase cleavage site.
Residue:
3
NA