Target
Tissue-type plasminogen activator
Ligand
BDBM16174
Substrate
BDBM12774
Meas. Tech.
Determination of Inhibition Constants
pH
8±n/a
Temperature
298.15±n/a K
Ki
8700±n/a nM
Citation
 Zeslawska, ESchweinitz, AKarcher, ASondermann, PSperl, SSturzebecher, JJacob, U Crystals of the urokinase type plasminogen activator variant beta(c)-uPAin complex with small molecule inhibitors open the way towards structure-based drug design. J Mol Biol 301:465-75 (2000)  
Target
Name:
Tissue-type plasminogen activator
Synonyms:
Alteplase Reteplase Thrombin receptor protein Tissue-type plasminogen activator (tPA) t-PA t-plasminogen activator
Type:
Enzyme
Mol. Mass.:
62931.08
Organism:
Homo sapiens (Human)
Description:
Residue:
562
  
Inhibitor
Name:
BDBM16174
Synonyms:
3-[3-(4-beta-alanylpiperazin-1-yl)-3-oxo-2-({[2,4,6-tris(1-methylethyl)phenyl]sulfonyl}amino)propyl]benzenecarboximidamide UKI-1D
Type:
Small organic molecule
Emp. Form.:
C32H48N6O4S
Mol. Mass.:
612.826
SMILES:
CC(C)c1cc(C(C)C)c(c(c1)C(C)C)S(=O)(=O)NC(Cc1cccc(c1)C(N)=N)C(=O)N1CCN(CC1)C(=O)CCN
:
Substrate
Name:
BDBM12774
Synonyms:
(2S)-5-carbamimidamido-2-{2-[(2R)-3-(4-hydroxycyclohexyl)-2-methanesulfonamidopropanamido]acetamido}-N-(4-nitrophenyl)pentanamide; acetic acid Factor IX Chromogenic Substrate Methylsulfonyl-D-hexahydrotyrosyl-glycyl-arginine-4-nitroanilide Spectrozyme tPA | tPA/Trypsin Substrate
Type:
Small organic molecule
Emp. Form.:
C24H38N8O8S
Mol. Mass.:
598.672
SMILES:
CS(=O)(=O)NC(CC1CCC(O)CC1)C(=O)NCC(=O)NC(CCC\[NH+]=C(\N)[NH-])C(=O)Nc1ccc(cc1)[N+]([O-])=O
: