Target
Beta-secretase 1
Ligand
BDBM16253
Substrate
Fluorogenic Substrate
Meas. Tech.
Enzyme Inhibition Measurements
pH
4.5±n/a
Temperature
310.15±n/a K
Ki
0.3±n/a nM
Citation
 Ghosh, AKKumaragurubaran, NHong, LLei, HHussain, KALiu, CFDevasamudram, TWeerasena, VTurner, RKoelsch, GBilcer, GTang, J Design, synthesis and X-ray structure of protein-ligand complexes: important insight into selectivity of memapsin 2 (beta-secretase) inhibitors. J Am Chem Soc 128:5310-1 (2006)  
Target
Name:
Beta-secretase 1
Synonyms:
ASP2 Aspartyl protease 2 BACE1 Beta-secretase (BACE) Beta-secretase 1 (BACE 1) Beta-secretase 1 (BACE1) Beta-site amyloid precursor protein cleaving enzyme 1 Memapsin-2 beta-Secretase (BACE-1) | beta-Secretase (BACE1)
Type:
Protein
Mol. Mass.:
55755.10
Organism:
Homo sapiens (Human)
Description:
P56817
Residue:
501
  
Inhibitor
Name:
BDBM16253
Synonyms:
(3,5-dimethyl-1H-pyrazol-1-yl)methyl N-[(1R)-1-{[(1R,3S,4S)-3-hydroxy-1,6-dimethyl-1-{[(1S)-2-methyl-1-[(2-methylpropyl)carbamoyl]propyl]carbamoyl}heptan-4-yl]carbamoyl}-2-methanesulfonylethyl]carbamate N2-[(2R,4S,5S)-5-{[N-{[(3,5-dimethyl-1H-pyrazol-1-yl)methoxy]carbonyl}-3-(methylsulfonyl)-L-alanyl]amino}-4-hydroxy-2,7-dimethyloctanoyl]-N-(2-methylpropyl)-L-valinamide | pyrazole-bearing inhibitor 5
Type:
Small organic molecule
Emp. Form.:
C30H54N6O8S
Mol. Mass.:
658.85
SMILES:
CC(C)CNC(=O)[C@@H](NC(=O)[C@H](C)C[C@H](O)[C@H](CC(C)C)NC(=O)[C@H](CS(C)(=O)=O)NC(=O)OCn1nc(C)cc1C)C(C)C
:
Substrate
Name:
Fluorogenic Substrate
Synonyms:
Type:
Peptide
Mol. Mass.:
4212.11
Organism:
Description:
Residue:
42