Target
Beta-secretase 1
Ligand
BDBM16264
Substrate
Fluorogenic Substrate
Meas. Tech.
Enzyme Inhibition Measurements
pH
4.5±n/a
Temperature
310.15±n/a K
Ki
87.2±n/a nM
Citation
 Ghosh, AKDevasamudram, THong, LDeZutter, CXu, XWeerasena, VKoelsch, GBilcer, GTang, J Structure-based design of cycloamide-urethane-derived novel inhibitors of human brain memapsin 2 (beta-secretase). Bioorg Med Chem Lett 15:15-20 (2005)  
Target
Name:
Beta-secretase 1
Synonyms:
ASP2 Aspartyl protease 2 BACE1 Beta-secretase (BACE) Beta-secretase 1 (BACE 1) Beta-secretase 1 (BACE1) Beta-site amyloid precursor protein cleaving enzyme 1 Memapsin-2 beta-Secretase (BACE-1) | beta-Secretase (BACE1)
Type:
Protein
Mol. Mass.:
55755.10
Organism:
Homo sapiens (Human)
Description:
P56817
Residue:
501
  
Inhibitor
Name:
BDBM16264
Synonyms:
(2R,4S,5S)-N-[(1S)-1-(benzylcarbamoyl)-2-methylpropyl]-4-hydroxy-2,7-dimethyl-5-{[(4S,7S,12E)-2,5,9-trioxo-4-(propan-2-yl)-1-oxa-3,6,10-triazacyclotetradec-12-en-7-yl]formamido}octanamide | amide-urethane derived inhibitor 3a
Type:
Small organic molecule
Emp. Form.:
C36H56N6O8
Mol. Mass.:
700.8652
SMILES:
CC(C)C[C@H](NC(=O)[C@@H]1CC(=O)NC\C=C\COC(=O)N[C@@H](C(C)C)C(=O)N1)[C@@H](O)C[C@@H](C)C(=O)N[C@@H](C(C)C)C(=O)NCc1ccccc1
:
Substrate
Name:
Fluorogenic Substrate
Synonyms:
Type:
Peptide
Mol. Mass.:
4212.11
Organism:
Description:
Residue:
42