Target
Prothrombin
Ligand
BDBM16304
Substrate
BDBM12679
Meas. Tech.
Enzyme Inhibition Assay
pH
8.2±n/a
Temperature
295.15±n/a K
Ki
101±n/a nM
Citation
 Katz, BAClark, JMFiner-Moore, JSJenkins, TEJohnson, CRRoss, MJLuong, CMoore, WRStroud, RM Design of potent selective zinc-mediated serine protease inhibitors. Nature 391:608-12 (1998)  
Target
Name:
Prothrombin
Synonyms:
Activation peptide fragment 1 Coagulation factor II Prothrombin precursor Thrombin heavy chain | Thrombin light chain
Type:
Protein
Mol. Mass.:
70029.57
Organism:
Homo sapiens (Human)
Description:
P00734
Residue:
622
  
Inhibitor
Name:
BDBM16304
Synonyms:
2-(1H-1,3-benzodiazol-2-ylcarbonyl)-1H-1,3-benzodiazole-6-carboximidamide APD-2
Type:
Small organic molecule
Emp. Form.:
C16H12N6O
Mol. Mass.:
304.3061
SMILES:
NC(=N)c1ccc2nc([nH]c2c1)C(=O)c1nc2ccccc2[nH]1
:
Substrate
Name:
BDBM12679
Synonyms:
BDBM13790 Chromogenic Substrate
Type:
Small organic molecule
Emp. Form.:
C26H34N6O7S
Mol. Mass.:
574.649
SMILES:
Cc1ccc(cc1)S(=O)(=O)NCC(=O)N1CCCC1C(=O)NC(CCCCN)C(=O)Nc1ccc(cc1)[N+]([O-])=O
: