Target
Ephrin type-A receptor 2
Ligand
BDBM351304
Substrate
Meas. Tech.
AlphaScreen Assay
IC50
<50±n/a nM
Citation
 Rice, KDAnand, NKBussenius, JCostanzo, SKennedy, ARPeto, CJTsang, THBlazey, CM Substituted quinazolines as receptor-type kinase inhibitors US Patent  US9796704 Publication Date 10/24/2017 
Target
Name:
Ephrin type-A receptor 2
Synonyms:
ECK EPHA2_HUMAN Epithelial cell kinase | Tyrosine-protein kinase receptor ECK
Type:
PROTEIN
Mol. Mass.:
108260.70
Organism:
Homo sapiens (Human)
Description:
ChEMBL_1505248
Residue:
976
  
Inhibitor
Name:
BDBM351304
Synonyms:
N-(4-bromo-3-chloro-2-fluorophenyl)-7- {[(3R,9aS)-hexahydro-1H-[1,4]oxazino[3,4- c][1,4]oxazin-3-ylmethyl]oxy}-6- (methyloxy)quinazolin-4-amine | US9796704, Entry 30
Type:
Small organic molecule
Emp. Form.:
C23H23BrClFN4O4
Mol. Mass.:
553.809
SMILES:
COc1cc2c(Nc3ccc(Br)c(Cl)c3F)ncnc2cc1OC[C@H]1CN2CCOCC2CO1
: