Target
Ephrin type-A receptor 2
Ligand
BDBM351398
Substrate
Meas. Tech.
AlphaScreen Assay
IC50
<50±n/a nM
Citation
 Rice, KDAnand, NKBussenius, JCostanzo, SKennedy, ARPeto, CJTsang, THBlazey, CM Substituted quinazolines as receptor-type kinase inhibitors US Patent  US9796704 Publication Date 10/24/2017 
Target
Name:
Ephrin type-A receptor 2
Synonyms:
ECK EPHA2_HUMAN Epithelial cell kinase | Tyrosine-protein kinase receptor ECK
Type:
PROTEIN
Mol. Mass.:
108260.70
Organism:
Homo sapiens (Human)
Description:
ChEMBL_1505248
Residue:
976
  
Inhibitor
Name:
BDBM351398
Synonyms:
1,4:3,6-dianhydro-2-deoxy-5-O-[4-[(2,5- dichlorophenyl)amino]-6- (methyloxy)quinazolin-7-yl]-2-fluoro-D-iditol | US9796704, Entry 118
Type:
Small organic molecule
Emp. Form.:
C21H18Cl2FN3O4
Mol. Mass.:
466.29
SMILES:
COc1cc2c(Nc3cc(Cl)ccc3Cl)ncnc2cc1O[C@@H]1CO[C@H]2[C@H](F)CO[C@@H]12
: