Target
Ephrin type-A receptor 2
Ligand
BDBM351460
Substrate
Meas. Tech.
AlphaScreen Assay
IC50
525±n/a nM
Citation
 Rice, KDAnand, NKBussenius, JCostanzo, SKennedy, ARPeto, CJTsang, THBlazey, CM Substituted quinazolines as receptor-type kinase inhibitors US Patent  US9796704 Publication Date 10/24/2017 
Target
Name:
Ephrin type-A receptor 2
Synonyms:
ECK EPHA2_HUMAN Epithelial cell kinase | Tyrosine-protein kinase receptor ECK
Type:
PROTEIN
Mol. Mass.:
108260.70
Organism:
Homo sapiens (Human)
Description:
ChEMBL_1505248
Residue:
976
  
Inhibitor
Name:
BDBM351460
Synonyms:
N-(3,4-dichlorophenyl)-6-(methyloxy)-7-[({3- [4-(methyloxy)phenyl]isoxazol-5- yl}methyl)oxy]quinazolin-4-amine | US9796704, Entry 180
Type:
Small organic molecule
Emp. Form.:
C26H20Cl2N4O4
Mol. Mass.:
523.367
SMILES:
COc1ccc(cc1)-c1cc(COc2cc3ncnc(Nc4ccc(Cl)c(Cl)c4)c3cc2OC)on1
: