Target
Ephrin type-A receptor 2
Ligand
BDBM351516
Substrate
Meas. Tech.
AlphaScreen Assay
IC50
<50±n/a nM
Citation
 Rice, KDAnand, NKBussenius, JCostanzo, SKennedy, ARPeto, CJTsang, THBlazey, CM Substituted quinazolines as receptor-type kinase inhibitors US Patent  US9796704 Publication Date 10/24/2017 
Target
Name:
Ephrin type-A receptor 2
Synonyms:
ECK EPHA2_HUMAN Epithelial cell kinase | Tyrosine-protein kinase receptor ECK
Type:
PROTEIN
Mol. Mass.:
108260.70
Organism:
Homo sapiens (Human)
Description:
ChEMBL_1505248
Residue:
976
  
Inhibitor
Name:
BDBM351516
Synonyms:
7-({[4-chloro-2-(trifluoromethyl)quinolin-6- yl]methyl}oxy)-N-(3,4-dichlorophenyl)-6- (methyloxy)quinazolin-4-amine | US9796704, Entry 236
Type:
Small organic molecule
Emp. Form.:
C26H16Cl3F3N4O2
Mol. Mass.:
579.785
SMILES:
COc1cc2c(Nc3ccc(Cl)c(Cl)c3)ncnc2cc1OCc1ccc2nc(cc(Cl)c2c1)C(F)(F)F
: