Target
Aldo-keto reductase family 1 member B1 [W220Y,C299A]
Ligand
BDBM16423
Substrate
BDBM16416
Meas. Tech.
Enzyme Inhibition Assay
Ki
62000±n/a nM
Citation
 Brownlee, JMCarlson, EMilne, ACPape, EHarrison, DH Structural and thermodynamic studies of simple aldose reductase-inhibitor complexes. Bioorg Chem 34:424-44 (2006)  
Target
Name:
Aldo-keto reductase family 1 member B1 [W220Y,C299A]
Synonyms:
AKR1B1 ALDR_HUMAN AR | Aldose Reductase (ALR2) Mutant (C299A/W220Y)
Type:
Enzyme
Mol. Mass.:
35800.39
Organism:
Homo sapiens (Human)
Description:
P15121[W220Y,C299A]
Residue:
316
  
Inhibitor
Name:
BDBM16423
Synonyms:
2-(2-methylphenyl)acetic acid NSC16053 | o-Tolylacetic acid
Type:
Small organic molecule
Emp. Form.:
C9H10O2
Mol. Mass.:
150.1745
SMILES:
Cc1ccccc1CC(O)=O
:
Substrate
Name:
BDBM16416
Synonyms:
pentane-1,2,3,4,5-pentol | xylitol
Type:
Small organic molecule
Emp. Form.:
C5H12O5
Mol. Mass.:
152.1458
SMILES:
OCC(O)C(O)C(O)CO
: