Target
Aldo-keto reductase family 1 member B1
Ligand
BDBM16457
Substrate
BDBM16443
Meas. Tech.
In Vitro Aldose Reductase Inhibition Assay
pH
7±n/a
Temperature
297.15±n/a K
IC50
25±n/a nM
Citation
 Mylari, BLArmento, SJBeebe, DAConn, ELCoutcher, JBDina, MSO'Gorman, MTLinhares, MCMartin, WHOates, PJTess, DAWithbroe, GJZembrowski, WJ A highly selective, non-hydantoin, non-carboxylic acid inhibitor of aldose reductase with potent oral activity in diabetic rat models: 6-(5-chloro-3-methylbenzofuran- 2-sulfonyl)-2-H-pyridazin-3-one. J Med Chem 46:2283-6 (2003)  
Target
Name:
Aldo-keto reductase family 1 member B1
Synonyms:
AKR1B1 ALDR_HUMAN AR Aldose Reductase (ALR2) Aldose reductase (AR)
Type:
Protein
Mol. Mass.:
35855.50
Organism:
Homo sapiens (Human)
Description:
P15121. 4LAU; 2IKI; 4LB4; 2FZD; 2FZ8; 1US0
Residue:
316
  
Inhibitor
Name:
BDBM16457
Synonyms:
6-[(5-chloro-1-benzofuran-2-)sulfonyl]-2,3-dihydropyridazin-3-one Heterocyclic Sulfonylpyridazinone, 19i | benzofuran, 23
Type:
Small organic molecule
Emp. Form.:
C12H7ClN2O4S
Mol. Mass.:
310.713
SMILES:
Clc1ccc2oc(cc2c1)S(=O)(=O)c1ccc(=O)[nH]n1
:
Substrate
Name:
BDBM16443
Synonyms:
(2R)-2,3-dihydroxypropanal Triose
Type:
Small organic molecule
Emp. Form.:
C3H6O3
Mol. Mass.:
90.0779
SMILES:
OC[C@@H](O)C=O
: