Target
Aldo-keto reductase family 1 member B1
Ligand
BDBM16452
Substrate
BDBM16241
Meas. Tech.
Enzyme Inhibition Assay
IC50
9±n/a nM
Citation
 Van Zandt, MCJones, MLGunn, DEGeraci, LSJones, JHSawicki, DRSredy, JJacot, JLDicioccio, ATPetrova, TMitschler, APodjarny, AD Discovery of 3-[(4,5,7-trifluorobenzothiazol-2-yl)methyl]indole-N-acetic acid (lidorestat) and congeners as highly potent and selective inhibitors of aldose reductase for treatment of chronic diabetic complications. J Med Chem 48:3141-52 (2005)  
Target
Name:
Aldo-keto reductase family 1 member B1
Synonyms:
AKR1B1 ALDR_HUMAN AR Aldose Reductase (ALR2) Aldose reductase (AR)
Type:
Protein
Mol. Mass.:
35855.50
Organism:
Homo sapiens (Human)
Description:
P15121. 4LAU; 2IKI; 4LB4; 2FZD; 2FZ8; 1US0
Residue:
316
  
Inhibitor
Name:
BDBM16452
Synonyms:
(4-oxo-3-{[5-(trifluoromethyl)-1,3-benzothiazol-2-yl]methyl}-3,4-dihydrophthalazin-1-yl)acetic acid Alond Xedia | Zopolrestat
Type:
Small organic molecule
Emp. Form.:
C19H12F3N3O3S
Mol. Mass.:
419.377
SMILES:
OC(=O)Cc1nn(Cc2nc3cc(ccc3s2)C(F)(F)F)c(=O)c2ccccc12
:
Substrate
Name:
BDBM16241
Synonyms:
2,3-dihydroxypropanal Glycerinformal | Glycerose
Type:
Small organic molecule
Emp. Form.:
C3H6O3
Mol. Mass.:
90.0779
SMILES:
OCC(O)C=O
: