Target
Aldo-keto reductase family 1 member B1
Ligand
BDBM16496
Substrate
BDBM16241
Meas. Tech.
Enzyme Inhibition Assay
IC50
8±n/a nM
Citation
 Van Zandt, MCJones, MLGunn, DEGeraci, LSJones, JHSawicki, DRSredy, JJacot, JLDicioccio, ATPetrova, TMitschler, APodjarny, AD Discovery of 3-[(4,5,7-trifluorobenzothiazol-2-yl)methyl]indole-N-acetic acid (lidorestat) and congeners as highly potent and selective inhibitors of aldose reductase for treatment of chronic diabetic complications. J Med Chem 48:3141-52 (2005)  
Target
Name:
Aldo-keto reductase family 1 member B1
Synonyms:
AKR1B1 ALDR_HUMAN AR Aldose Reductase (ALR2) Aldose reductase (AR)
Type:
Protein
Mol. Mass.:
35855.50
Organism:
Homo sapiens (Human)
Description:
P15121. 4LAU; 2IKI; 4LB4; 2FZD; 2FZ8; 1US0
Residue:
316
  
Inhibitor
Name:
BDBM16496
Synonyms:
2-{3-[(4-bromo-2-fluorophenyl)methyl]-7-chloro-2,4-dioxo-1,2,3,4-tetrahydroquinazolin-1-yl}acetic acid FR 74366 [3-(4-bromo-2-fluorobenzyl)-7-chloro-2,4-dioxo-3,4-dihydroquinazolin-1(2H)-yl]acetic acid
Type:
Small organic molecule
Emp. Form.:
C17H11BrClFN2O4
Mol. Mass.:
441.636
SMILES:
OC(=O)Cn1c2cc(Cl)ccc2c(=O)n(Cc2ccc(Br)cc2F)c1=O
:
Substrate
Name:
BDBM16241
Synonyms:
2,3-dihydroxypropanal Glycerinformal | Glycerose
Type:
Small organic molecule
Emp. Form.:
C3H6O3
Mol. Mass.:
90.0779
SMILES:
OCC(O)C=O
: