Target
Carbonic anhydrase 4
Ligand
BDBM11634
Substrate
BDBM11326
Meas. Tech.
Esterase Assay
Ki
8±n/a nM
Citation
 Vullo, DFranchi, MGallori, EAntel, JScozzafava, ASupuran, CT Carbonic anhydrase inhibitors. Inhibition of mitochondrial isozyme V with aromatic and heterocyclic sulfonamides. J Med Chem 47:1272-9 (2004)  
Target
Name:
Carbonic anhydrase 4
Synonyms:
CA-IV CAH4_BOVIN Carbonic Anhydrase IV Carbonic anhydrase 4
Type:
Enzyme
Mol. Mass.:
35152.74
Organism:
Bos taurus (bovine)
Description:
Bovine isozyme, isolated from lung microsomes
Residue:
312
  
Inhibitor
Name:
BDBM11634
Synonyms:
2,3,4,5,6-pentafluoro-N-(3-methyl-5-sulfamoyl-2,3-dihydro-1,3,4-thiadiazol-2-ylidene)benzamide heterocyclic sulfonamide compound 38
Type:
Small organic molecule
Emp. Form.:
C10H5F5N4O3S2
Mol. Mass.:
388.294
SMILES:
Cn1nc(sc1=NC(=O)c1c(F)c(F)c(F)c(F)c1F)S(N)(=O)=O
:
Substrate
Name:
BDBM11326
Synonyms:
4-nitrophenyl acetate | p-Nitrophenyl Acetate
Type:
Small organic molecule
Emp. Form.:
C8H7NO4
Mol. Mass.:
181.1455
SMILES:
CC(=O)Oc1ccc(cc1)[N+]([O-])=O
: