Target
Ubiquitin carboxyl-terminal hydrolase 1/WD repeat-containing protein 48
Ligand
BDBM352008
Substrate
Meas. Tech.
Inhibition Assay
IC50
1100±n/a nM
Citation
 Maloney, DJRosenthal, ASJadhav, ADexheimer, TSSimeonov, AZhuang, ZLiang, QLuci, DK Inhibitors of the USP1/UAF1 deubiquitinase complex and uses thereof US Patent  US9802904 Publication Date 10/31/2017 
Target
Name:
Ubiquitin carboxyl-terminal hydrolase 1/WD repeat-containing protein 48
Synonyms:
USP1/UAF1 | Ubiquitin carboxyl-terminal hydrolase 1/WD repeat-containing protein 48
Type:
Protein
Mol. Mass.:
Description:
Components:
This complex has 2 components.
Component 1
Name:
WD repeat-containing protein 48
Synonyms:
KIAA1449 USP1-associated factor 1 WD repeat endosomal protein WDR48 p80
Type:
PROTEIN
Mol. Mass.:
76215.66
Organism:
Homo sapiens (Human)
Description:
ChEMBL_109642
Residue:
677
  
Component 2
Name:
Ubiquitin carboxyl-terminal hydrolase 1
Synonyms:
Deubiquitinating enzyme 1 USP1 Ubiquitin thioesterase 1 hUBP
Type:
PROTEIN
Mol. Mass.:
88191.62
Organism:
Homo sapiens (Human)
Description:
ChEMBL_104169
Residue:
785
  
Inhibitor
Name:
BDBM352008
Synonyms:
US9802904, 70
Type:
Small organic molecule
Emp. Form.:
C23H27N3O
Mol. Mass.:
361.48
SMILES:
CC(C)c1ccccc1-c1ncc(C)c(NC(CO)c2cccc(C)c2)n1
: