Target
Beta-secretase 1
Ligand
BDBM16691
Substrate
BACE Substrate Peptide
Meas. Tech.
In Vitro BACE1 Activity Assay
pH
4.5±n/a
Temperature
295.15±n/a K
IC50
117±n/a nM
Citation
 Coburn, CAStachel, SJJones, KGSteele, TGRush, DMDiMuzio, JPietrak, BLLai, MTHuang, QLineberger, JJin, LMunshi, SKatharine Holloway, MEspeseth, ASimon, AHazuda, DGraham, SLVacca, JP BACE-1 inhibition by a series of psi[CH2NH] reduced amide isosteres. Bioorg Med Chem Lett 16:3635-8 (2006)  
Target
Name:
Beta-secretase 1
Synonyms:
ASP2 Aspartyl protease 2 BACE1 Beta-secretase (BACE) Beta-secretase 1 (BACE 1) Beta-secretase 1 (BACE1) Beta-site amyloid precursor protein cleaving enzyme 1 Memapsin-2 beta-Secretase (BACE-1) | beta-Secretase (BACE1)
Type:
Protein
Mol. Mass.:
55755.10
Organism:
Homo sapiens (Human)
Description:
P56817
Residue:
501
  
Inhibitor
Name:
BDBM16691
Synonyms:
1-N-[(1R)-1-(4-fluorophenyl)ethyl]-5-(N-methylmethanesulfonamido)-3-N-[(2S)-1-({[(2-methylpropyl)carbamoyl]methyl}amino)-3-phenylpropan-2-yl]benzene-1,3-dicarboxamide | psi[CH2NH] reduced amide isostere, 4a
Type:
Small organic molecule
Emp. Form.:
C33H42FN5O5S
Mol. Mass.:
639.78
SMILES:
CC(C)CNC(=O)CNC[C@H](Cc1ccccc1)NC(=O)c1cc(cc(c1)C(=O)N[C@H](C)c1ccc(F)cc1)N(C)S(C)(=O)=O
:
Substrate
Name:
BACE Substrate Peptide
Synonyms:
BACE-1 Substrate Peptide
Type:
Peptide
Mol. Mass.:
1557.77
Organism:
Description:
It is a coumarin (CM)-labeled peptide containing an optimized cleavage sequence NFEV.
Residue:
12
CMREVNFEVEFR