Target
Integrin alpha-4/beta-1 [T112H]
Ligand
BDBM16811
Substrate
VCAM-1
Meas. Tech.
Ramos Cell Adhesion Assay (alpha4beta1 Mediated Adhesion/VCAM-1)
pH
7.4±n/a
Temperature
295.15±n/a K
IC50
480±61 nM
Citation
 Gong, YBarbay, JKDyatkin, ABMiskowski, TAKimball, ESProuty, SMFisher, MCSantulli, RJSchneider, CRWallace, NHBallentine, SAHageman, WEMasucci, JAMaryanoff, BEDamiano, BPAndrade-Gordon, PHlasta, DJHornby, PJHe, W Synthesis and biological evaluation of novel pyridazinone-based alpha4 integrin receptor antagonists. J Med Chem 49:3402-11 (2006)  
Target
Name:
Integrin alpha-4/beta-1 [T112H]
Synonyms:
CD49d/CD29 Very Late Antigen-4
Type:
Protein Complex
Mol. Mass.:
Description:
The assay uses transfected Ramos cells expressing alpha4beta1 integrin.
Components:
This complex has 2 components.
Component 1
Name:
Integrin alpha-4
Synonyms:
CD49 antigen-like family member D CD49d antigen ITA4_HUMAN Integrin alpha-4 Integrin alpha-IV VLA-4 integrin alpha 4 precursor | integrin alpha-4 precursor
Type:
Membrane Protein
Mol. Mass.:
114897.35
Organism:
Homo sapiens (Human)
Description:
P13612
Residue:
1032
  
Component 2
Name:
Integrin beta-1 [T112H]
Synonyms:
CD29 antigen Fibronectin receptor subunit beta ITGB1 Integrin beta1 MSK12
Type:
Membrane Protein
Mol. Mass.:
88450.95
Organism:
Homo sapiens (Human)
Description:
P05556[T112H]
Residue:
798
  
Inhibitor
Name:
BDBM16811
Synonyms:
(2S)-2-[(2,6-dichlorophenyl)formamido]-3-[4-(5-hydroxy-2-methyl-3-oxo-2,3-dihydropyridazin-4-yl)phenyl]propanoic acid | pyridazinone-based antagonist, 13
Type:
Small organic molecule
Emp. Form.:
C21H17Cl2N3O5
Mol. Mass.:
462.283
SMILES:
Cn1ncc(O)c(-c2ccc(C[C@H](NC(=O)c3c(Cl)cccc3Cl)C(O)=O)cc2)c1=O
:
Substrate
Name:
Vascular cell adhesion protein 1
Synonyms:
CD106 antigen VCAM-1 VCAM1_HUMAN Vascular cell adhesion protein 1 (VCAM-1) | Vascular cell adhesion protein 1 precursor
Type:
Other Protein Type
Mol. Mass.:
81259.16
Organism:
Homo sapiens (Human)
Description:
P19320
Residue:
739