Target
Integrin alpha-4/beta-1 [T112H]
Ligand
BDBM16836
Substrate
VCAM-1
Meas. Tech.
Ramos Cell Adhesion Assay (alpha4beta1 Mediated Adhesion/VCAM-1)
pH
7.4±n/a
Temperature
295.15±n/a K
IC50
9±8 nM
Citation
 Dyatkin, ABGong, YMiskowski, TAKimball, ESProuty, SMFisher, MCSantulli, RJSchneider, CRWallace, NHHornby, PJDiamond, CKinney, WAMaryanoff, BEDamiano, BPHe, W Aza-bicyclic amino acid carboxamides as alpha4beta1/alpha4beta7 integrin receptor antagonists. Bioorg Med Chem 13:6693-702 (2005)  
Target
Name:
Integrin alpha-4/beta-1 [T112H]
Synonyms:
CD49d/CD29 Very Late Antigen-4
Type:
Protein Complex
Mol. Mass.:
Description:
The assay uses transfected Ramos cells expressing alpha4beta1 integrin.
Components:
This complex has 2 components.
Component 1
Name:
Integrin alpha-4
Synonyms:
CD49 antigen-like family member D CD49d antigen ITA4_HUMAN Integrin alpha-4 Integrin alpha-IV VLA-4 integrin alpha 4 precursor | integrin alpha-4 precursor
Type:
Membrane Protein
Mol. Mass.:
114897.35
Organism:
Homo sapiens (Human)
Description:
P13612
Residue:
1032
  
Component 2
Name:
Integrin beta-1 [T112H]
Synonyms:
CD29 antigen Fibronectin receptor subunit beta ITGB1 Integrin beta1 MSK12
Type:
Membrane Protein
Mol. Mass.:
88450.95
Organism:
Homo sapiens (Human)
Description:
P05556[T112H]
Residue:
798
  
Inhibitor
Name:
BDBM16836
Synonyms:
(2S)-2-{[(3S)-2-(3-{[(tert-butoxy)carbonyl]amino}propanoyl)-2-azabicyclo[2.2.2]octan-3-yl]formamido}-3-{4-[(3,5-dichloropyridine-4-)amido]phenyl}propanoic acid | azabicyclo[2.2.2]octane derivative, 21
Type:
Small organic molecule
Emp. Form.:
C31H37Cl2N5O7
Mol. Mass.:
662.561
SMILES:
CC(C)(C)OC(=O)NCCC(=O)N1C2CCC(CC2)[C@H]1C(=O)N[C@@H](Cc1ccc(NC(=O)c2c(Cl)cncc2Cl)cc1)C(O)=O
:
Substrate
Name:
Vascular cell adhesion protein 1
Synonyms:
CD106 antigen VCAM-1 VCAM1_HUMAN Vascular cell adhesion protein 1 (VCAM-1) | Vascular cell adhesion protein 1 precursor
Type:
Other Protein Type
Mol. Mass.:
81259.16
Organism:
Homo sapiens (Human)
Description:
P19320
Residue:
739