Target
Integrin alpha-4/beta-1 [T112H]
Ligand
BDBM16848
Substrate
VCAM-1
Meas. Tech.
Ramos Cell Adhesion Assay (alpha4beta1 Mediated Adhesion/VCAM-1)
pH
7.4±n/a
Temperature
295.15±n/a K
IC50
23±5 nM
Citation
 Dyatkin, ABGong, YMiskowski, TAKimball, ESProuty, SMFisher, MCSantulli, RJSchneider, CRWallace, NHHornby, PJDiamond, CKinney, WAMaryanoff, BEDamiano, BPHe, W Aza-bicyclic amino acid carboxamides as alpha4beta1/alpha4beta7 integrin receptor antagonists. Bioorg Med Chem 13:6693-702 (2005)  
Target
Name:
Integrin alpha-4/beta-1 [T112H]
Synonyms:
CD49d/CD29 Very Late Antigen-4
Type:
Protein Complex
Mol. Mass.:
Description:
The assay uses transfected Ramos cells expressing alpha4beta1 integrin.
Components:
This complex has 2 components.
Component 1
Name:
Integrin alpha-4
Synonyms:
CD49 antigen-like family member D CD49d antigen ITA4_HUMAN Integrin alpha-4 Integrin alpha-IV VLA-4 integrin alpha 4 precursor | integrin alpha-4 precursor
Type:
Membrane Protein
Mol. Mass.:
114897.35
Organism:
Homo sapiens (Human)
Description:
P13612
Residue:
1032
  
Component 2
Name:
Integrin beta-1 [T112H]
Synonyms:
CD29 antigen Fibronectin receptor subunit beta ITGB1 Integrin beta1 MSK12
Type:
Membrane Protein
Mol. Mass.:
88450.95
Organism:
Homo sapiens (Human)
Description:
P05556[T112H]
Residue:
798
  
Inhibitor
Name:
BDBM16848
Synonyms:
(2S)-3-{4-[(3,5-dichloropyridine-4-)amido]phenyl}-2-{[(3S)-2-[2-(3,5-dimethoxyphenyl)acetyl]-2-azabicyclo[2.2.2]octan-3-yl]formamido}propanoic acid | azabicyclo[2.2.2]octane derivative, 33
Type:
Small organic molecule
Emp. Form.:
C33H34Cl2N4O7
Mol. Mass.:
669.552
SMILES:
COc1cc(CC(=O)N2C3CCC(CC3)[C@H]2C(=O)N[C@@H](Cc2ccc(NC(=O)c3c(Cl)cncc3Cl)cc2)C(O)=O)cc(OC)c1
:
Substrate
Name:
Vascular cell adhesion protein 1
Synonyms:
CD106 antigen VCAM-1 VCAM1_HUMAN Vascular cell adhesion protein 1 (VCAM-1) | Vascular cell adhesion protein 1 precursor
Type:
Other Protein Type
Mol. Mass.:
81259.16
Organism:
Homo sapiens (Human)
Description:
P19320
Residue:
739