Target
Integrin alpha-4/beta-7
Ligand
BDBM16855
Substrate
MAdCAM-1
Meas. Tech.
Ramos Cell Adhesion Assay (alpha4beta1 Mediated Adhesion/VCAM-1)
Temperature
277.15±n/a K
IC50
7±n/a nM
Comments
extracted
Citation
 Dyatkin, ABGong, YMiskowski, TAKimball, ESProuty, SMFisher, MCSantulli, RJSchneider, CRWallace, NHHornby, PJDiamond, CKinney, WAMaryanoff, BEDamiano, BPHe, W Aza-bicyclic amino acid carboxamides as alpha4beta1/alpha4beta7 integrin receptor antagonists. Bioorg Med Chem 13:6693-702 (2005)  
Target
Name:
Integrin alpha-4/beta-7
Synonyms:
Integrin α4β7 Integrin alpha-4/beta7 | Integrin alpha4beta7
Type:
Protein Complex
Mol. Mass.:
Description:
The assay uses stably transfected K562 cells expressing human alpha4beta7 integrin.
Components:
This complex has 2 components.
Component 1
Name:
Integrin alpha-4
Synonyms:
CD49 antigen-like family member D CD49d antigen ITA4_HUMAN Integrin alpha-4 Integrin alpha-IV VLA-4 integrin alpha 4 precursor | integrin alpha-4 precursor
Type:
Membrane Protein
Mol. Mass.:
114897.35
Organism:
Homo sapiens (Human)
Description:
P13612
Residue:
1032
  
Component 2
Name:
Integrin beta-7
Synonyms:
ITB7_HUMAN Integrin alpha-4/beta-7 Integrin beta7
Type:
Membrane Protein
Mol. Mass.:
86893.88
Organism:
Homo sapiens (Human)
Description:
P26010
Residue:
798
  
Inhibitor
Name:
BDBM16855
Synonyms:
(2S)-3-{4-[(3,5-dichloropyridine-4-)amido]phenyl}-2-{[(3S)-2-[3-(4-methoxyphenyl)propanoyl]-2-azabicyclo[2.2.2]octan-3-yl]formamido}propanoic acid | azabicyclo[2.2.2]octane derivative, 40
Type:
Small organic molecule
Emp. Form.:
C33H34Cl2N4O6
Mol. Mass.:
653.552
SMILES:
COc1ccc(CCC(=O)N2C3CCC(CC3)[C@H]2C(=O)N[C@@H](Cc2ccc(NC(=O)c3c(Cl)cncc3Cl)cc2)C(O)=O)cc1
:
Substrate
Name:
MAdCAM-1
Synonyms:
Mucosal addressin cell adhesion molecule 1 | hMAdCAM-1
Type:
Other Protein Type
Mol. Mass.:
42675.21
Organism:
Homo sapiens (Human)
Description:
Recombinant FLAG-hMAdCAM-1.
Residue:
406