Target
RAC-alpha serine/threonine-protein kinase [139-480,S378A,S381A,T450D,S473D]
Ligand
BDBM16936
Substrate
biotinylated Akt peptide substrate
Meas. Tech.
Akt Kinase Assay
pH
7.5±n/a
Temperature
295.15±n/a K
IC50
1020±n/a nM
Citation
 Zhu, GDGandhi, VBGong, JLuo, YLiu, XShi, YGuan, RMagnone, SRKlinghofer, VJohnson, EFBouska, JShoemaker, AOleksijew, AJarvis, KPark, CJong, RDOltersdorf, TLi, QRosenberg, SHGiranda, VL Discovery and SAR of oxindole-pyridine-based protein kinase B/Akt inhibitors for treating cancers. Bioorg Med Chem Lett 16:3424-9 (2006)  
Target
Name:
RAC-alpha serine/threonine-protein kinase [139-480,S378A,S381A,T450D,S473D]
Synonyms:
AKT1 C-AKT Protein kinase B (Akt 1) RAC | RAC-PK-alpha
Type:
Enzyme
Mol. Mass.:
39513.28
Organism:
Homo sapiens (Human)
Description:
Recombinant His-tagged Akt1 (S378A, S381A, T450D, S473D; 139-480)
Residue:
342
  
Inhibitor
Name:
BDBM16936
Synonyms:
5-{5-[(2S)-2-amino-3-(1H-indol-3-yl)propoxy]pyridin-3-yl}-3-benzyl-2,3-dihydro-1H-indol-2-one | oxindole pyridine, 9r
Type:
Small organic molecule
Emp. Form.:
C31H28N4O2
Mol. Mass.:
488.5796
SMILES:
N[C@H](COc1cncc(c1)-c1ccc2NC(=O)C(Cc3ccccc3)c2c1)Cc1c[nH]c2ccccc12
:
Substrate
Name:
biotinylated Akt peptide substrate
Synonyms:
Type:
Biotinylated Peptide
Mol. Mass.:
3178.04
Organism:
Description:
Km=15 uM
Residue:
28