Target
Integrin alpha-4/beta-1 [T112H]
Ligand
BDBM17169
Substrate
BDBM17155
Meas. Tech.
Jurkat J6 Scintillation Proximity Assay
pH
7.5±n/a
Temperature
295.15±n/a K
Ki
0.79±n/a nM
Citation
 Witherington, JBlaney, ELBordas, VElliott, RLGaiba, AGarton, NGreen, PMNaylor, ASmith, DGSpalding, DJTakle, AKWard, RW Pyridone derivatives as potent, orally bioavailable VLA-4 integrin antagonists. Bioorg Med Chem Lett 16:5538-41 (2006)  
Target
Name:
Integrin alpha-4/beta-1 [T112H]
Synonyms:
CD49d/CD29 Very Late Antigen-4
Type:
Protein Complex
Mol. Mass.:
Description:
The assay uses transfected Ramos cells expressing alpha4beta1 integrin.
Components:
This complex has 2 components.
Component 1
Name:
Integrin alpha-4
Synonyms:
CD49 antigen-like family member D CD49d antigen ITA4_HUMAN Integrin alpha-4 Integrin alpha-IV VLA-4 integrin alpha 4 precursor | integrin alpha-4 precursor
Type:
Membrane Protein
Mol. Mass.:
114897.35
Organism:
Homo sapiens (Human)
Description:
P13612
Residue:
1032
  
Component 2
Name:
Integrin beta-1 [T112H]
Synonyms:
CD29 antigen Fibronectin receptor subunit beta ITGB1 Integrin beta1 MSK12
Type:
Membrane Protein
Mol. Mass.:
88450.95
Organism:
Homo sapiens (Human)
Description:
P05556[T112H]
Residue:
798
  
Inhibitor
Name:
BDBM17169
Synonyms:
(3R)-3-(4-{[3-(3-methoxy-4-{[(2-methylphenyl)carbamoyl]amino}phenyl)-2-oxo-1,2-dihydropyridin-1-yl]methyl}phenyl)butanoic acid | Pyridone derivative, 15
Type:
Small organic molecule
Emp. Form.:
C31H31N3O5
Mol. Mass.:
525.5949
SMILES:
COc1cc(ccc1NC(=O)Nc1ccccc1C)-c1cccn(Cc2ccc(cc2)[C@H](C)CC(O)=O)c1=O
:
Substrate
Name:
BDBM17155
Synonyms:
(2S)-3-[4-({[4-(aminocarbonyl)-1-piperidinyl]carbonyl}oxy)phenyl]-2-[((2S)-4-methyl-2-{[2-(2-methylphenoxy)acetyl]amino}pentanoyl)amino] propanoic acid potassium salt potassium (2S)-3-{4-[(4-carbamoylpiperidin-1-yl)carbonyloxy]phenyl}-2-[(2S)-4-methyl-2-[2-(2-methylphenoxy)acetamido]pentanamido]propanoate
Type:
Small organic molecule
Emp. Form.:
C31H39N4O8
Mol. Mass.:
595.6639
SMILES:
CC(C)C[C@H](NC(=O)COc1ccccc1C)C(=O)N[C@@H](Cc1ccc(OC(=O)N2CCC(CC2)C(N)=O)cc1)C([O-])=O
: